{"text_format":"1","workbook":"xlsx","n_sheets":4,"sheets":["Formular","Kombifelder","Rententabelle","Berechnung Landw. Barwerte"],"not_rendered":{"charts":0,"images":1,"macros":1,"external_links":1,"defined_names":5,"comments":0,"pivot_tables":0},"unopened":[],"bounds":{"document_bytes":16777216,"sheet_cells":100000,"rows_first":2000,"rows_last":500,"rows_between":2000,"halvings":0,"cell_chars":16384,"cell_head_chars":4096},"cells_cut":0,"cells_raw":0,"read":"whole","date_system":"1900"}

{"sheet":"Formular","index":0,"n_rows":53,"n_cols":14,"rows_kept":53,"cut":false,"hidden":false,"merged":[[10,9,12,10],[39,6,39,9],[35,4,36,4],[17,4,18,4],[43,1,43,10],[41,1,41,2],[25,1,25,10],[20,1,20,2],[21,1,21,2],[23,1,23,2],[21,6,21,9]]}
[null,"Steuerverwaltung"]
[null,"Grundstückgewinnsteuer"]
[]
[]
[]
[null,"Berechnung Barwert von Nutzungsrechten"]
[]
[null,"Bestimmung per (Grundbucheintrag)",null,null,{"$f":"TODAY()","v":"2020-11-05"}]
[]
[null,"Art des Nutzungsrechts",null,null,{"$f":"VLOOKUP(Kombifelder!F3,Kombifelder!E4:F6,2)","v":"Wohnrecht etc."}]
[null,null,null,null,null,null,null,null,null,{"$f":"IF(Kombifelder!F7=2,\"Nur möglich bei echter Nutz-niessung (Art. 745 - 775 ZGB)!\",\"\")","v":""}]
[null,"Einkommenssteuer: Erwerber versteuert Grundstück",null,null,{"$f":"VLOOKUP(Kombifelder!F7,Kombifelder!E8:F9,2)","v":"ab Eigentumserwerb (i.d.R. Grundbucheintrag)"},null,null,null,null,null,null,null,null,{"$f":"IF(AND(Kombifelder!F3=3,Kombifelder!F7=2),1,0)","v":0}]
[]
[null,"Objektart",null,null,{"$f":"VLOOKUP(Kombifelder!F11,Kombifelder!E12:F13,2)","v":"Nichtlandwirtschaftliches Grundstück"}]
[]
[null,"Ausübung des Nutzungsrechts",null,null,{"$f":"VLOOKUP(Kombifelder!F15,Kombifelder!E16:F17,2)","v":"Persönlich durch berechtigte Person"}]
[]
[null,"Objektbezogener Jahresertrag1",null,null,"(Betrag CHF)",null,"Subjektbezogene Leistungen (pro Person)2"]
[]
[null,{"$f":"IF(AND(Kombifelder!F15=1,Kombifelder!F11=1),\"Aktueller Eigenmietwert : 65 x 100\",IF(AND(Kombifelder!F11=2,Kombifelder!F15=1),\"Mietwert gem. aktueller Schätzung\",\"Marktüblicher jährlicher Ertrag\"))","v":"Aktueller Eigenmietwert : 65 x 100"},null,null,0,null,null,null,null,null,"(Betrag CHF)"]
[null,"Nebenleistungen (Heizung, Strom, Wasser etc.)*",null,null,0,null,"Naturalbezüge*",null,null,null,0]
[null,null,null,null,0,null,null,null,null,null,0]
[null,null,null,null,{"$f":"SUM(E20:E22)","v":0},null,"Total",null,null,null,{"$f":"SUM(K21:K22)","v":0}]
[null,null,null,null,0]
[null,"Total",null,null,{"$f":"E23-E24","v":0}]
[null,"* Sofern Teil des Nutzungsrechts und von erwerbender Person bezahlt resp. erbracht."]
[null,"Berechnung (Barwert lebenslänglicher Nutzung)"]
[null,"Name, Vorname","Geschlecht",null,"Geb.-Datum",null,"Alter","Faktor3","BW Objekt","BW Subjekt","Total (CHF)"]
[null,null,"Mann",null,null,null,{"$f":"IF(E29=0,\"\",ROUNDDOWN(DAYS360(E29,$E$8,1)/360,0))","v":""},{"$f":"IF(E29=0,0,IF(Kombifelder!$B$5=1,0,\nIF(Kombifelder!$B$5=2,VLOOKUP(G29,Rententabelle!$A$5:$E$104,IF(Kombifelder!$F$11=1,3,5)),\nVLOOKUP(G29,Rententabelle!$A$5:$E$104,IF(Kombifelder!$F$11=1,2,4)))))","v":0},{"$f":"IF(E29=0,0,IF(Kombifelder!B5=1,0,IF(H29<=H30,0,ROUNDDOWN(E$25*H29,0))))","v":0},{"$f":"IF(E29=0,0,IF(Kombifelder!B5=1,0,ROUNDDOWN(K$23*H29,0)))","v":0},{"$f":"SUM(I29:J29)","v":0}]
[null,null,"Frau",null,null,null,{"$f":"IF(E30=0,\"\",ROUNDDOWN(DAYS360(E30,$E$8,1)/360,0))","v":""},{"$f":"IF(E30=0,0,IF(Kombifelder!$B$9=1,0,\nIF(Kombifelder!$B$9=2,VLOOKUP(G30,Rententabelle!$A$5:$E$104,IF(Kombifelder!$F$11=1,3,5)),\nVLOOKUP(G30,Rententabelle!$A$5:$E$104,IF(Kombifelder!$F$11=1,2,4)))))","v":0},{"$f":"IF(E30=0,0,IF(Kombifelder!B9=1,0,\nIF(H30<H29,0,ROUNDDOWN(E$25*H30,0))))","v":0},{"$f":"IF(E30=0,0,IF(Kombifelder!B9=1,0,ROUNDDOWN(K$23*H30,0)))","v":0},{"$f":"SUM(I30:J30)","v":0}]
[null,null,null,null,null,null,null,null,null,"Barwert ",{"$f":"SUM(K29:K30)","v":0}]
[null,"1 Bestimmung Barwert: Person mit höherem Faktor x Total objektbezogener Jahresertrag."]
[null,"2 Bestimmung Barwert: Faktor (pro Person) x Total subjektbezogene Leistungen."]
[null,{"$f":"CONCATENATE(\"  \",\"Faktor nach \"&IF(Kombifelder!F11=2,Rententabelle!D2,Rententabelle!B2&\".\"))","v":"  Faktor nach Stauffer/Schätzle 6. Auflage, Tafeln M1x und M1y (3.5 %, gültig ab 01.01.2014)."}]
[null,"V_11.2020",null,null,null,null,null,null,null,null,{"$f":"+TODAY()","v":"2020-11-05"}]
[null,"Objektbezogener Jahresertrag1",null,null,"(Betrag CHF)",null,"Subjektbezogene Leistungen (pro Person)2"]
[]
[null,"Nebenleistungen (Heizung, Strom, Wasser etc.)*",null,null,0,null,null,null,null,null,"(Betrag CHF)"]
[null,"Schuldzinsen*",null,null,0,null,"Naturalbezüge*",null,null,null,0]
[null,"Liegenschaftsunterhaltskosten*",null,null,0,null,null,null,null,null,0]
{"$rows_left_out":14}
{"sheet":"Kombifelder","index":1,"n_rows":26,"n_cols":6,"rows_kept":26,"cut":false,"hidden":true,"merged":[[19,1,19,2],[19,3,19,4]]}
[]
[]
[null,null,null,null,"Kombifeld",1]
[null,null,null,null,1,"Wohnrecht etc."]
["Kombifeld",3,null,null,2,"Obligatorisch/dinglicher Mietvertrag"]
[0," ",null,null,3,"Nutzniessung"]
[1,"Frau",null,null,"Kombifeld",1]
[2,"Mann",null,null,1,"ab Eigentumserwerb (i.d.R. Grundbucheintrag)"]
["Kombifeld",2,null,null,2,"ab Ablauf der Nutzniessung"]
[0," "]
[1,"Frau",null,null,"Kombifeld",1]
[2,"Mann",null,null,1,"Nichtlandwirtschaftliches Grundstück"]
[null,null,null,null,2,"Landwirtschaftliches Grundstück"]
[]
[null,null,null,null,"Kombifeld",1]
[null,null,null,null,1,"Persönlich durch berechtigte Person"]
[null,null,null,null,2,"Durch Drittpersonen"]
[]
["Steuerung Rententabelle"]
[null,"Nichtlandwirtsch.",null,"Landwirtschaftlich"]
["Jahr","Mann","Frau","Mann","Frau"]
[0,0,0,0,0]
[2001,10,11,6,7]
[2004,10,11,8,9]
[2014,12,13,8,9]
[2021,14,15,16,17]

{"sheet":"Rententabelle","index":2,"n_rows":104,"n_cols":17,"rows_kept":104,"cut":false,"hidden":true,"merged":[[1,13,1,14],[1,15,1,16],[1,1,1,2],[1,3,1,4],[1,5,1,6],[1,7,1,8],[1,11,1,12],[1,9,1,10]]}
[{"$f":"Formular!E8","v":"2020-11-05"},null,null,null,null,"2001-01-01","bis 31.12.03","2004-01-01","bis 31.12.2020","2001-01-01","bis 31.12.13","2014-01-01","bis 31.12.2020","2021-01-01","bis …","2021-01-01","bis …"]
["A",{"$f":"VLOOKUP($A2,$A2:$Q2,VLOOKUP(YEAR($A$1),Kombifelder!$A$23:$E$27,2))","v":"Stauffer/Schätzle 6. Auflage, Tafeln M1x und M1y (3.5 %, gültig ab 01.01.2014)"},{"$f":"VLOOKUP($A2,$A2:$M2,VLOOKUP(YEAR($A$1),Kombifelder!$A$23:$E$27,2))","v":"Stauffer/Schätzle 6. Auflage, Tafeln M1x und M1y (3.5 %, gültig ab 01.01.2014)"},{"$f":"VLOOKUP($A2,$A2:$Q2,VLOOKUP(YEAR($A$1),Kombifelder!$A$23:$E$27,4))","v":"Stauffer/Schätzle 2001 Tafel 20 (Zins 4.2 % gem. eidg. Schätz.-Anleitung; gültig ab 01.01.2004)."},{"$f":"VLOOKUP($A2,$A2:$M2,VLOOKUP(YEAR($A$1),Kombifelder!$A$23:$E$27,4))","v":"Stauffer/Schätzle 2001 Tafel 20 (Zins 4.2 % gem. eidg. Schätz.-Anleitung; gültig ab 01.01.2004)."},"Stauffer/Schätzle 2001 Tafel 20, 5.5 %",null,"Stauffer/Schätzle 2001 Tafel 20 (Zins 4.2 % gem. eidg. Schätz.-Anleitung; gültig ab 01.01.2004).",null,"Stauffer/Schätzle 2001 Tafel 1, 3.5 %",null,"Stauffer/Schätzle 6. Auflage, Tafeln M1x und M1y (3.5 %, gültig ab 01.01.2014)",null,"Stauffer/Schätzle 7. Auflage, Tafeln M1x und M1y (3.5 %, gültig ab 01.01.2021)",null,"Stauffer/Schätzle 7. Auflage, (Zins 4.24 % gem. eidg. Schätz.-Anleitung; gültig ab 1.1.2021)."]
["Alter","Mann","Frau","Mann","Frau","Mann","Frau","Mann","Frau","Mann","Frau","Mann","Frau","Mann","Frau","Mann","Frau"]
[1,2,3,4,5,6,7,8,9,10,11,12,13,14,15,16,17]
[0]
[1]
[2]
[3]
[4]
[5]
[6]
[7]
[8]
[9]
[10]
[11]
[12]
[13]
[14]
[15]
[16]
[17]
[18]
[19]
[20]
[21]
[22]
[23]
[24]
[25]
[26]
[27]
[28]
[29]
[30]
[31,{"$f":"VLOOKUP($A36,$A36:$Q36,VLOOKUP(YEAR($A$1),Kombifelder!$A$23:$E$27,2))","v":24.05},{"$f":"VLOOKUP($A36,$A36:$Q36,VLOOKUP(YEAR($A$1),Kombifelder!$A$23:$E$27,3))","v":24.73},{"$f":"VLOOKUP($A36,$A36:$Q36,VLOOKUP(YEAR($A$1),Kombifelder!$A$23:$E$27,4))","v":20.58},{"$f":"VLOOKUP($A36,$A36:$Q36,VLOOKUP(YEAR($A$1),Kombifelder!$A$23:$E$27,5))","v":21.64},16.920000000000002,17.559999999999999,20.58,21.64,23.17,24.58,24.05,24.73,24.28,24.84,21.177976154961641,21.473094881406066]
[32,{"$f":"VLOOKUP($A37,$A37:$Q37,VLOOKUP(YEAR($A$1),Kombifelder!$A$23:$E$27,2))","v":23.89},{"$f":"VLOOKUP($A37,$A37:$Q37,VLOOKUP(YEAR($A$1),Kombifelder!$A$23:$E$27,3))","v":24.58},{"$f":"VLOOKUP($A37,$A37:$Q37,VLOOKUP(YEAR($A$1),Kombifelder!$A$23:$E$27,4))","v":20.47},{"$f":"VLOOKUP($A37,$A37:$Q37,VLOOKUP(YEAR($A$1),Kombifelder!$A$23:$E$27,5))","v":21.54},16.86,17.510000000000002,20.47,21.54,23.01,24.44,23.89,24.58,24.12,24.7,21.078005226999455,21.38446804227873]
[33,{"$f":"VLOOKUP($A38,$A38:$Q38,VLOOKUP(YEAR($A$1),Kombifelder!$A$23:$E$27,2))","v":23.72},{"$f":"VLOOKUP($A38,$A38:$Q38,VLOOKUP(YEAR($A$1),Kombifelder!$A$23:$E$27,3))","v":24.43},{"$f":"VLOOKUP($A38,$A38:$Q38,VLOOKUP(YEAR($A$1),Kombifelder!$A$23:$E$27,4))","v":20.36},{"$f":"VLOOKUP($A38,$A38:$Q38,VLOOKUP(YEAR($A$1),Kombifelder!$A$23:$E$27,5))","v":21.43},16.8,17.45,20.36,21.43,22.85,24.29,23.72,24.43,23.95,24.55,20.972797571261726,21.292121780610362]
[34,{"$f":"VLOOKUP($A39,$A39:$Q39,VLOOKUP(YEAR($A$1),Kombifelder!$A$23:$E$27,2))","v":23.54},{"$f":"VLOOKUP($A39,$A39:$Q39,VLOOKUP(YEAR($A$1),Kombifelder!$A$23:$E$27,3))","v":24.27},{"$f":"VLOOKUP($A39,$A39:$Q39,VLOOKUP(YEAR($A$1),Kombifelder!$A$23:$E$27,4))","v":20.23},{"$f":"VLOOKUP($A39,$A39:$Q39,VLOOKUP(YEAR($A$1),Kombifelder!$A$23:$E$27,5))","v":21.32},16.73,17.39,20.23,21.32,22.68,24.13,23.54,24.27,23.78,24.39,20.864304626612181,21.195900002556531]
[35,{"$f":"VLOOKUP($A40,$A40:$Q40,VLOOKUP(YEAR($A$1),Kombifelder!$A$23:$E$27,2))","v":23.36},{"$f":"VLOOKUP($A40,$A40:$Q40,VLOOKUP(YEAR($A$1),Kombifelder!$A$23:$E$27,3))","v":24.11},{"$f":"VLOOKUP($A40,$A40:$Q40,VLOOKUP(YEAR($A$1),Kombifelder!$A$23:$E$27,4))","v":20.100000000000001},{"$f":"VLOOKUP($A40,$A40:$Q40,VLOOKUP(YEAR($A$1),Kombifelder!$A$23:$E$27,5))","v":21.21},16.649999999999999,17.329999999999998,20.100000000000001,21.21,22.5,23.97,23.36,24.11,23.6,24.23,20.751305467580554,21.095640063447252]
{"$rows_left_out":65}
{"sheet":"Berechnung Landw. Barwerte","index":3,"n_rows":74,"n_cols":6,"rows_kept":74,"cut":false,"hidden":true,"merged":[[3,2,3,3],[2,4,2,5],[4,4,4,5]]}
[]
[null,"Barwert berechnen"]
[null,null,null,null,"Landwirtsch."]
[null,null,"Mittlere Lebens- erwartung\n(Stauffer, Schätzle Tafel Z3)",null,"Männer","Frauen"]
[null,"Alter","Männer","Frauen",4.24E-2]
[null,31,54.96,58.11,{"$f":"((($E$5+1)^C6)-1)/((($E$5+1)^(C6))*$E$5)","v":21.177976154961641},21.473094881406066]
[null,32,53.98,57.12,21.078005226999455,21.38446804227873]
[null,33,52.99,56.13,20.972797571261726,21.292121780610362]
[null,34,52.01,55.14,20.864304626612181,21.195900002556531]
[null,35,51.03,54.15,{"$f":"((($E$5+1)^C10)-1)/((($E$5+1)^(C10))*$E$5)","v":20.751305467580554},21.095640063447252]
[null,36,50.05,53.16,{"$f":"((($E$5+1)^C11)-1)/((($E$5+1)^(C11))*$E$5)","v":20.633612930216941},20.991172492866994]
[null,37,49.07,52.17,20.511032076785909,20.882320708197085]
[null,38,48.09,51.19,20.38335987288519,20.770069840459502]
[null,39,47.11,50.2,20.250384851153619,20.651938990922293]
[null,40,46.14,49.22,20.113328658646637,20.530119303653578]
[null,41,45.17,48.24,19.970639152995364,20.403239880670579]
[null,42,44.19,47.25,19.820521928609423,20.269714195498924]
[null,43,43.23,46.27,19.667424518784419,20.132018942534309]
[null,44,42.26,45.3,19.506407365135399,19.990097648956993]
[null,45,41.3,44.32,19.34053492240119,19.84078862601346]
[null,46,40.340000000000003,43.35,19.167916450793879,19.68689712123982]
[null,47,39.380000000000003,42.38,18.988277589456366,19.526680334691033]
[null,48,38.43,41.41,18.803318821248819,19.359878283273197]
[null,49,37.479999999999997,40.44,18.610917696294322,19.186220298011307]
[null,50,36.53,39.479999999999997,18.410774749612184,19.007325853767931]
[null,51,35.590000000000003,38.520000000000003,18.204813053940136,18.821155776114868]
[null,52,34.65,37.56,17.990652837431313,18.627414165189286]
[null,53,33.71,36.6,17.767967749383985,18.425793086886955]
[null,54,32.78,35.64,17.538929606427189,18.215972083429886]
[null,55,31.85,34.69,17.300873235713489,17.999937345430869]
[null,56,30.92,33.74,17.053443550396537,17.775209818192909]
[null,57,30,32.79,16.799089928127678,17.541439721928487]
[null,58,29.09,31.84,16.537758044206587,17.298263202437802]
[null,59,28.18,30.9,16.266361879696635,17.048016820378319]
[null,60,27.27,29.97,15.984513844142898,16.790631078337153]
[null,61,26.38,29.04,15.698364031668662,16.523110940281679]
[null,62,25.49,28.11,15.401440864720234,16.245057370967125]
[null,63,24.6,27.19,15.093338733503142,15.959222902684349]
[null,64,23.73,26.27,14.780951609744337,15.662257231134557]
[null,65,22.87,25.36,14.460862026072141,15.357144224629147]
{"$rows_left_out":34}